Reaction Details
TargetCytochrome P450 2J2
LigandBDBM50183085
Substrate/Competitorn/a
Meas. Tech.ChEMBL_350781 (CHEMBL869679)
IC50 600±n/a nM
Citation Lafite, PDijols, SBuisson, DMacherey, ACZeldin, DCDansette, PMMansuy, D Design and synthesis of selective, high-affinity inhibitors of human cytochrome P450 2J2. Bioorg Med Chem Lett16:2777-80 (2006) 
 
Cytochrome P450 2J2
Name:Cytochrome P450 2J2
Type:Enzyme
Mol. Mass.:57623.04
Organism:Homo sapiens (Human)
Description:P51589
Residue:502
BDBM50183085
NameBDBM50183085
Synonyms:1-(4-ethylphenyl)-4-(4-(hydroxydiphenylmethyl)piperidin-1-yl)butan-1-one | CHEMBL207982
TypeSmall organic molecule
Emp. Form.C30H35NO2
Mol. Mass.441.6044
SMILESCCc1ccc(cc1)C(=O)CCCN1CCC(CC1)C(O)(c1ccccc1)c1ccccc1