Reaction Details
TargetCytochrome P450 3A4
LigandBDBM50183075
Substrate/Competitorn/a
Meas. Tech.ChEMBL_350785 (CHEMBL869683)
IC50 5500±n/a nM
Citation Lafite, PDijols, SBuisson, DMacherey, ACZeldin, DCDansette, PMMansuy, D Design and synthesis of selective, high-affinity inhibitors of human cytochrome P450 2J2. Bioorg Med Chem Lett16:2777-80 (2006) 
 
Cytochrome P450 3A4
Name:Cytochrome P450 3A4
Type:Enzyme
Mol. Mass.:57349.57
Organism:Homo sapiens (Human)
Description:n/a
Residue:503
BDBM50183075
NameBDBM50183075
Synonyms:1-(4-allylphenyl)-4-(4-(hydroxydiphenylmethyl)piperidin-1-yl)butan-1-one | CHEMBL207831
TypeSmall organic molecule
Emp. Form.C31H35NO2
Mol. Mass.453.6151
SMILESOC(C1CCN(CCCC(=O)c2ccc(CC=C)cc2)CC1)(c1ccccc1)c1ccccc1