Reaction Details
TargetSodium-dependent serotonin transporter
LigandBDBM50183141
Substrate/Competitorn/a
Meas. Tech.ChEMBL_355134 (CHEMBL853187)
Ki 0.40±n/a nM
Citation Boot, JRBoulet, SLClark, BPCases-Thomas, MJDelhaye, LDiker, KFairhurst, JFindlay, JGallagher, PTGilmore, JHarris, JRMasters, JJMitchell, SNNaik, MSimmonds, RGSmith, SMRichards, SJTimms, GHWhatton, MAWolfe, CNWood, VA N-Alkyl-N-arylmethylpiperidin-4-amines: novel dual inhibitors of serotonin and norepinephrine reuptake. Bioorg Med Chem Lett16:2714-8 (2006) 
 
Sodium-dependent serotonin transporter
Name:Sodium-dependent serotonin transporter
Type:Multi-pass membrane protein
Mol. Mass.:70322.51
Organism:Homo sapiens (Human)
Description:P31645
Residue:630
BDBM50183141
NameBDBM50183141
Synonyms:3-((4-fluoro-2-(trifluoromethyl)benzyl)(piperidin-4-yl)amino)propanenitrile tartaric acid salt | CHEMBL206152
TypeSmall organic molecule
Emp. Form.C16H19F4N3
Mol. Mass.329.3358
SMILESFc1ccc(CN(CCC#N)C2CCNCC2)c(c1)C(F)(F)F