Reaction Details
TargetSodium-dependent serotonin transporter
LigandBDBM50183147
Substrate/Competitorn/a
Meas. Tech.ChEMBL_355134 (CHEMBL853187)
Ki 1.1±n/a nM
Citation Boot, JRBoulet, SLClark, BPCases-Thomas, MJDelhaye, LDiker, KFairhurst, JFindlay, JGallagher, PTGilmore, JHarris, JRMasters, JJMitchell, SNNaik, MSimmonds, RGSmith, SMRichards, SJTimms, GHWhatton, MAWolfe, CNWood, VA N-Alkyl-N-arylmethylpiperidin-4-amines: novel dual inhibitors of serotonin and norepinephrine reuptake. Bioorg Med Chem Lett16:2714-8 (2006) 
 
Sodium-dependent serotonin transporter
Name:Sodium-dependent serotonin transporter
Type:Multi-pass membrane protein
Mol. Mass.:70322.51
Organism:Homo sapiens (Human)
Description:P31645
Residue:630
BDBM50183147
NameBDBM50183147
Synonyms:CHEMBL207755 | N-(4-fluoro-2-(trifluoromethyl)benzyl)-N-(3-methoxypropyl)piperidin-4-amine tartaric acid salt
TypeSmall organic molecule
Emp. Form.C17H24F4N2O
Mol. Mass.348.3789
SMILESCOCCCN(Cc1ccc(F)cc1C(F)(F)F)C1CCNCC1