Reaction Details
TargetSodium-dependent noradrenaline transporter
LigandBDBM50183170
Substrate/Competitorn/a
Meas. Tech.ChEMBL_355136 (CHEMBL853189)
Ki 3.1±n/a nM
Citation Boot, JRBoulet, SLClark, BPCases-Thomas, MJDelhaye, LDiker, KFairhurst, JFindlay, JGallagher, PTGilmore, JHarris, JRMasters, JJMitchell, SNNaik, MSimmonds, RGSmith, SMRichards, SJTimms, GHWhatton, MAWolfe, CNWood, VA N-Alkyl-N-arylmethylpiperidin-4-amines: novel dual inhibitors of serotonin and norepinephrine reuptake. Bioorg Med Chem Lett16:2714-8 (2006) 
 
Sodium-dependent noradrenaline transporter
Name:Sodium-dependent noradrenaline transporter
Type:Multi-pass membrane protein
Mol. Mass.:69337.72
Organism:Homo sapiens (Human)
Description:P23975
Residue:617
BDBM50183170
NameBDBM50183170
Synonyms:CHEMBL207480 | N-(4-fluoro-2-(trifluoromethyl)benzyl)-N-(cyclobutylmethyl)piperidin-4-amine tartaric acid salt
TypeSmall organic molecule
Emp. Form.C18H24F4N2
Mol. Mass.344.3902
SMILESFc1ccc(CN(CC2CCC2)C2CCNCC2)c(c1)C(F)(F)F