Reaction Details
TargetSodium-dependent serotonin transporter
LigandBDBM50183173
Substrate/Competitorn/a
Meas. Tech.ChEMBL_355134 (CHEMBL853187)
Ki 0.70±n/a nM
Citation Boot, JRBoulet, SLClark, BPCases-Thomas, MJDelhaye, LDiker, KFairhurst, JFindlay, JGallagher, PTGilmore, JHarris, JRMasters, JJMitchell, SNNaik, MSimmonds, RGSmith, SMRichards, SJTimms, GHWhatton, MAWolfe, CNWood, VA N-Alkyl-N-arylmethylpiperidin-4-amines: novel dual inhibitors of serotonin and norepinephrine reuptake. Bioorg Med Chem Lett16:2714-8 (2006) 
 
Sodium-dependent serotonin transporter
Name:Sodium-dependent serotonin transporter
Type:Multi-pass membrane protein
Mol. Mass.:70322.51
Organism:Homo sapiens (Human)
Description:P31645
Residue:630
BDBM50183173
NameBDBM50183173
Synonyms:4-((4-fluoro-2-(trifluoromethyl)benzyl)(piperidin-4-yl)amino)-2,2-dimethylbutanenitrile tartaric acid | CHEMBL207634
TypeSmall organic molecule
Emp. Form.C19H25F4N3
Mol. Mass.371.4155
SMILESCC(C)(CCN(Cc1ccc(F)cc1C(F)(F)F)C1CCNCC1)C#N