Reaction Details
TargetSodium-dependent serotonin transporter
LigandBDBM50183151
Substrate/Competitorn/a
Meas. Tech.ChEMBL_355134 (CHEMBL853187)
Ki 1.6±n/a nM
Citation Boot, JRBoulet, SLClark, BPCases-Thomas, MJDelhaye, LDiker, KFairhurst, JFindlay, JGallagher, PTGilmore, JHarris, JRMasters, JJMitchell, SNNaik, MSimmonds, RGSmith, SMRichards, SJTimms, GHWhatton, MAWolfe, CNWood, VA N-Alkyl-N-arylmethylpiperidin-4-amines: novel dual inhibitors of serotonin and norepinephrine reuptake. Bioorg Med Chem Lett16:2714-8 (2006) 
 
Sodium-dependent serotonin transporter
Name:Sodium-dependent serotonin transporter
Type:Multi-pass membrane protein
Mol. Mass.:70322.51
Organism:Homo sapiens (Human)
Description:P31645
Residue:630
BDBM50183151
NameBDBM50183151
Synonyms:CHEMBL208251 | N-(2-chlorobenzyl)-N-isobutylpiperidin-4-amine fumaric acid
TypeSmall organic molecule
Emp. Form.C16H25ClN2
Mol. Mass.280.836
SMILESCC(C)CN(Cc1ccccc1Cl)C1CCNCC1