Reaction Details
TargetCytochrome P450 3A4
LigandBDBM50183183
Substrate/Competitorn/a
Meas. Tech.ChEMBL_354698 (CHEMBL870680)
IC50>50000±n/a nM
Citation Hall, ABit, RABrown, SHChaignot, HMChessell, IPColeman, TGiblin, GMHurst, DNKilford, IRLewell, XQMichel, ADMohamed, SNaylor, ANovelli, RSkinner, LSpalding, DJTang, SPWilson, RJ Discovery of novel biaryl heterocyclic EP1 receptor antagonists. Bioorg Med Chem Lett16:2666-71 (2006) 
 
Cytochrome P450 3A4
Name:Cytochrome P450 3A4
Type:Enzyme
Mol. Mass.:57349.57
Organism:Homo sapiens (Human)
Description:n/a
Residue:503
BDBM50183183
NameBDBM50183183
Synonyms:3-(3-(2-(benzyloxy)-5-chlorophenyl)pyridin-2-yl)benzoic acid | CHEMBL206096
TypeSmall organic molecule
Emp. Form.C25H18ClNO3
Mol. Mass.415.868
SMILESOC(=O)c1cccc(c1)-c1ncccc1-c1cc(Cl)ccc1OCc1ccccc1