Reaction Details
TargetReverse transcriptase/RNaseH
LigandBDBM50183203
Substrate/Competitorn/a
Meas. Tech.ChEMBL_355438 (CHEMBL868998)
IC50 1252±n/a nM
Citation Muraglia, EKinzel, ODLaufer, RMiller, MDMoyer, GMunshi, VOrvieto, FPalumbi, MCPescatore, GRowley, MWilliams, PDSumma, V Tetrazole thioacetanilides: potent non-nucleoside inhibitors of WT HIV reverse transcriptase and its K103N mutant. Bioorg Med Chem Lett16:2748-52 (2006) 
 
Reverse transcriptase/RNaseH
Name:Reverse transcriptase/RNaseH
Type:PROTEIN
Mol. Mass.:65229.15
Organism:Human immunodeficiency virus 1
Description:ChEMBL_1473730
Residue:566
BDBM50183203
NameBDBM50183203
Synonyms:CHEMBL208008 | N-(4-sulfamoyl-phenyl)-2-[1-(2,4,6-trimethyl-phenyl)-1H-tetrazol-5-ylsulfanyl]-acetamide
TypeSmall organic molecule
Emp. Form.C18H20N6O3S2
Mol. Mass.432.52
SMILESCc1cc(C)c(c(C)c1)-n1nnnc1SCC(=O)Nc1ccc(cc1)S(N)(=O)=O