Reaction Details
TargetReverse transcriptase/RNaseH
LigandBDBM50183204
Substrate/Competitorn/a
Meas. Tech.ChEMBL_355438 (CHEMBL868998)
IC50 54±n/a nM
Citation Muraglia, EKinzel, ODLaufer, RMiller, MDMoyer, GMunshi, VOrvieto, FPalumbi, MCPescatore, GRowley, MWilliams, PDSumma, V Tetrazole thioacetanilides: potent non-nucleoside inhibitors of WT HIV reverse transcriptase and its K103N mutant. Bioorg Med Chem Lett16:2748-52 (2006) 
 
Reverse transcriptase/RNaseH
Name:Reverse transcriptase/RNaseH
Type:PROTEIN
Mol. Mass.:65229.15
Organism:Human immunodeficiency virus 1
Description:ChEMBL_1473730
Residue:566
BDBM50183204
NameBDBM50183204
Synonyms:CHEMBL208057 | N-(2-methyl-4-sulfamoyl-phenyl)-2-[1-(2,4,6-trimethyl-phenyl)-1H-tetrazol-5-ylsulfanyl]-acetamide
TypeSmall organic molecule
Emp. Form.C19H22N6O3S2
Mol. Mass.446.546
SMILESCc1cc(C)c(c(C)c1)-n1nnnc1SCC(=O)Nc1ccc(cc1C)S(N)(=O)=O