Reaction Details
TargetReverse transcriptase/RNaseH
LigandBDBM50183191
Substrate/Competitorn/a
Meas. Tech.ChEMBL_355438 (CHEMBL868998)
IC50 18±n/a nM
Citation Muraglia, EKinzel, ODLaufer, RMiller, MDMoyer, GMunshi, VOrvieto, FPalumbi, MCPescatore, GRowley, MWilliams, PDSumma, V Tetrazole thioacetanilides: potent non-nucleoside inhibitors of WT HIV reverse transcriptase and its K103N mutant. Bioorg Med Chem Lett16:2748-52 (2006) 
 
Reverse transcriptase/RNaseH
Name:Reverse transcriptase/RNaseH
Type:PROTEIN
Mol. Mass.:65229.15
Organism:Human immunodeficiency virus 1
Description:ChEMBL_1473730
Residue:566
BDBM50183191
NameBDBM50183191
Synonyms:2-(1-(2,3-dimethylphenyl)-1H-tetrazol-5-ylthio)-N-(2-nitrophenyl)acetamide | CHEMBL382454
TypeSmall organic molecule
Emp. Form.C17H16N6O3S
Mol. Mass.384.412
SMILESCc1cccc(c1C)-n1nnnc1SCC(=O)Nc1ccccc1[N+]([O-])=O