Reaction Details
TargetReverse transcriptase/RNaseH
LigandBDBM50183217
Substrate/Competitorn/a
Meas. Tech.ChEMBL_355438 (CHEMBL868998)
IC50 3±n/a nM
Citation Muraglia, EKinzel, ODLaufer, RMiller, MDMoyer, GMunshi, VOrvieto, FPalumbi, MCPescatore, GRowley, MWilliams, PDSumma, V Tetrazole thioacetanilides: potent non-nucleoside inhibitors of WT HIV reverse transcriptase and its K103N mutant. Bioorg Med Chem Lett16:2748-52 (2006) 
 
Reverse transcriptase/RNaseH
Name:Reverse transcriptase/RNaseH
Type:PROTEIN
Mol. Mass.:65229.15
Organism:Human immunodeficiency virus 1
Description:ChEMBL_1473730
Residue:566
BDBM50183217
NameBDBM50183217
Synonyms:CHEMBL206522 | N-(2-chloro-4-sulfamoyl-phenyl)-2-[1-(2,5-dichloro-phenyl)-1H-tetrazol-5-ylsulfanyl]-acetamide
TypeSmall organic molecule
Emp. Form.C15H11Cl3N6O3S2
Mol. Mass.493.775
SMILESNS(=O)(=O)c1ccc(NC(=O)CSc2nnnn2-c2cc(Cl)ccc2Cl)c(Cl)c1