Reaction Details
TargetCytochrome P450 26A1
LigandBDBM50183239
Substrate/Competitorn/a
Meas. Tech.ChEMBL_355279 (CHEMBL853200)
IC50 37±n/a nM
Citation Mulvihill, MJKan, JLCooke, ABhagwat, SBeck, PBittner, MCesario, CKeane, DLazarescu, VNigro, ANillson, CPanicker, BSmith, VSrebernak, MSun, FLO'Connor, MRusso, SFischetti, GVrkljan, MWinski, SCastelhano, ALEmerson, DGibson, NW 3-[6-(2-Dimethylamino-1-imidazol-1-yl-butyl)-naphthalen-2-yloxy]-2,2-dimethyl-propionic acid as a highly potent and selective retinoic acid metabolic blocking agent. Bioorg Med Chem Lett16:2729-33 (2006) 
 
Cytochrome P450 26A1
Name:Cytochrome P450 26A1
Type:Enzyme
Mol. Mass.:56216.16
Organism:Homo sapiens (Human)
Description:O43174
Residue:497
BDBM50183239
NameBDBM50183239
Synonyms:2-((6-((1R,2R)-2-(dimethylamino)-1-(1H-imidazol-1-yl)propyl)naphthalen-2-yloxy)methyl)-2-ethylbutanoic acid | CHEMBL377286
TypeSmall organic molecule
Emp. Form.C25H33N3O3
Mol. Mass.423.5478
SMILESCCC(CC)(COc1ccc2cc(ccc2c1)[C@H]([C@@H](C)N(C)C)n1ccnc1)C(O)=O