Reaction Details
TargetIntegrase
LigandBDBM23402
Substrate/Competitorn/a
Meas. Tech.ChEMBL_336353 (CHEMBL865324)
IC50 23±n/a nM
Citation Sato, MMotomura, TAramaki, HMatsuda, TYamashita, MIto, YKawakami, HMatsuzaki, YWatanabe, WYamataka, KIkeda, SKodama, EMatsuoka, MShinkai, H Novel HIV-1 integrase inhibitors derived from quinolone antibiotics. J Med Chem49:1506-8 (2006) 
 
Integrase
Name:Integrase
Synonyms:Human immunodeficiency virus type 1 integrase
Type:PROTEIN
Mol. Mass.:32231.48
Organism:Human immunodeficiency virus 1
Description:ChEMBL_90865
Residue:288
BDBM23402
NameBDBM23402
TypeSmall organic molecule
Emp. Form.C20H19FN4O4S
Mol. Mass.430.453
SMILESOc1c(nc(N2CCCCS2(=O)=O)c2cccnc12)C(=O)NCc1ccc(F)cc1