Reaction Details
TargetIntegrase
LigandBDBM50183276
Substrate/Competitorn/a
Meas. Tech.ChEMBL_336353 (CHEMBL865324)
IC50 24±n/a nM
Citation Sato, MMotomura, TAramaki, HMatsuda, TYamashita, MIto, YKawakami, HMatsuzaki, YWatanabe, WYamataka, KIkeda, SKodama, EMatsuoka, MShinkai, H Novel HIV-1 integrase inhibitors derived from quinolone antibiotics. J Med Chem49:1506-8 (2006) 
 
Integrase
Name:Integrase
Synonyms:Human immunodeficiency virus type 1 integrase
Type:PROTEIN
Mol. Mass.:32231.48
Organism:Human immunodeficiency virus 1
Description:ChEMBL_90865
Residue:288
BDBM50183276
NameBDBM50183276
TypeSmall organic molecule
Emp. Form.C19H15ClFNO4
Mol. Mass.375.778
SMILESOCCn1cc(C(O)=O)c(=O)c2cc(Cc3cccc(Cl)c3F)ccc12