Reaction Details
TargetMalonyl-CoA decarboxylase, mitochondrial
LigandBDBM50183316
Substrate/Competitorn/a
Meas. Tech.ChEMBL_336476 (CHEMBL859660)
IC50 1.99±n/a nM
Citation Cheng, JFChen, MWallace, DTith, SHaramura, MLiu, BMak, CCArrhenius, TReily, SBrown, SThorn, VHarmon, CBarr, RDyck, JRLopaschuk, GDNadzan, AM Synthesis and structure-activity relationship of small-molecule malonyl coenzyme A decarboxylase inhibitors. J Med Chem49:1517-25 (2006) 
 
Malonyl-CoA decarboxylase, mitochondrial
Name:Malonyl-CoA decarboxylase, mitochondrial
Type:PROTEIN
Mol. Mass.:55018.37
Organism:Homo sapiens (Human)
Description:ChEMBL_665404
Residue:493
BDBM50183316
NameBDBM50183316
Synonyms:CHEMBL202746 | N-methyl-N-phenethyl-4-(2,2,2-trifluoro-1-hydroxy-1-trifluoromethylethyl)benzamide
TypeSmall organic molecule
Emp. Form.C19H17F6NO2
Mol. Mass.405.3342
SMILESCN(CCc1ccccc1)C(=O)c1ccc(cc1)C(O)(C(F)(F)F)C(F)(F)F