Reaction Details
TargetRNA-directed RNA polymerase
LigandBDBM50158845
Substrate/Competitorn/a
Meas. Tech.ChEMBL_337082 (CHEMBL864369)
IC50 44±n/a nM
Citation Koch, UAttenni, BMalancona, SColarusso, SConte, IDi Filippo, MHarper, SPacini, BGiomini, CThomas, SIncitti, ITomei, LDe Francesco, RAltamura, SMatassa, VGNarjes, F 2-(2-Thienyl)-5,6-dihydroxy-4-carboxypyrimidines as inhibitors of the hepatitis C virus NS5B polymerase: discovery, SAR, modeling, and mutagenesis. J Med Chem49:1693-705 (2006) 
 
RNA-directed RNA polymerase
Name:RNA-directed RNA polymerase
Type:Protein
Mol. Mass.:25173.95
Organism:Hepatitis C virus
Description:Q8JXU8
Residue:229
BDBM50158845
NameBDBM50158845
Synonyms:2-(3-(3-(2-chlorobenzyl)ureido)thiophen-2-yl)-5,6-dihydroxypyrimidine-4-carboxylic acid 2-{3-[3-(2-Chloro-benzyl)-ureido]-thiophen-2-yl}-5-hydroxy-6-oxo-1,6-dihydro-pyrimidine-4-carboxylic acid | CHEMBL175882
TypeSmall organic molecule
Emp. Form.C17H13ClN4O5S
Mol. Mass.420.827
SMILESOC(=O)c1nc([nH]c(=O)c1O)-c1sccc1NC(=O)NCc1ccccc1Cl