Reaction Details
TargetSodium-dependent serotonin transporter
LigandBDBM50183535
Substrate/Competitorn/a
Meas. Tech.ChEMBL_335143 (CHEMBL867623)
Ki 43±n/a nM
Citation Greiner, EBoos, TLPrisinzano, TEDe Martino, MGZeglis, BDersch, CMMarcus, JPartilla, JSRothman, RBJacobson, AERice, KC Design and synthesis of promiscuous high-affinity monoamine transporter ligands: unraveling transporter selectivity. J Med Chem49:1766-72 (2006) 
 
Sodium-dependent serotonin transporter
Name:Sodium-dependent serotonin transporter
Type:Multi-pass membrane protein
Mol. Mass.:70322.51
Organism:Homo sapiens (Human)
Description:P31645
Residue:630
BDBM50183535
NameBDBM50183535
Synonyms:(R)-(+)-4-[2-[bis-(4-fluorophenyl)methoxy]ethyl]-1-(3-phenylpropan-3-ol)-piperidine oxalate | CHEMBL383682
TypeSmall organic molecule
Emp. Form.C29H33F2NO2
Mol. Mass.465.5746
SMILESO[C@H](CCN1CCC(CCOC(c2ccc(F)cc2)c2ccc(F)cc2)CC1)c1ccccc1