Reaction Details
TargetMatrix metalloproteinase-9
LigandBDBM50183713
Substrate/Competitorn/a
Meas. Tech.ChEMBL_354461 (CHEMBL853096)
Ki>2128±n/a nM
Citation Gilmore, JLKing, BWHarris, CMaduskuie, TMercer, SELiu, RQCovington, MBQian, MRibadeneria, MDVaddi, KTrzaskos, JMNewton, RCDecicco, CPDuan, JJ Synthesis and structure-activity relationship of a novel, achiral series of TNF-alpha converting enzyme inhibitors. Bioorg Med Chem Lett16:2699-704 (2006) 
 
Matrix metalloproteinase-9
Name:Matrix metalloproteinase-9
Type:Enzyme
Mol. Mass.:78452.28
Organism:Homo sapiens (Human)
Description:P14780
Residue:707
BDBM50183713
NameBDBM50183713
Synonyms:CHEMBL208172 | N-(1-(2-(ethylsulfonyl)ethyl)-4-(2-(hydroxyamino)-2-oxoethyl)piperidin-4-yl)-4-((2-methylquinolin-4-yl)methoxy)benzamide
TypeSmall organic molecule
Emp. Form.C29H36N4O6S
Mol. Mass.568.684
SMILESCCS(=O)(=O)CCN1CCC(CC(=O)NO)(CC1)NC(=O)c1ccc(OCc2cc(C)nc3ccccc23)cc1