Reaction Details
TargetMatrix metalloproteinase-15
LigandBDBM50183711
Substrate/Competitorn/a
Meas. Tech.ChEMBL_354473 (CHEMBL853108)
Ki>7088±n/a nM
Citation Gilmore, JLKing, BWHarris, CMaduskuie, TMercer, SELiu, RQCovington, MBQian, MRibadeneria, MDVaddi, KTrzaskos, JMNewton, RCDecicco, CPDuan, JJ Synthesis and structure-activity relationship of a novel, achiral series of TNF-alpha converting enzyme inhibitors. Bioorg Med Chem Lett16:2699-704 (2006) 
 
Matrix metalloproteinase-15
Name:Matrix metalloproteinase-15
Type:PROTEIN
Mol. Mass.:75814.08
Organism:Homo sapiens (Human)
Description:ChEMBL_106793
Residue:669
BDBM50183711
NameBDBM50183711
Synonyms:CHEMBL208009 | N-(4-(2-(hydroxyamino)-2-oxoethyl)piperidin-4-yl)-4-((2-methylquinolin-4-yl)methoxy)benzamide
TypeSmall organic molecule
Emp. Form.C25H28N4O4
Mol. Mass.448.5142
SMILESCc1cc(COc2ccc(cc2)C(=O)NC2(CC(=O)NO)CCNCC2)c2ccccc2n1