Reaction Details
TargetCysteine protease
LigandBDBM50183760
Substrate/Competitorn/a
Meas. Tech.ChEMBL_350622 (CHEMBL869006)
Ki 5000±n/a nM
Citation Vicik, RHoerr, VGlaser, MSchultheis, MHansell, EMcKerrow, JHHolzgrabe, UCaffrey, CRPonte-Sucre, AMoll, HStich, ASchirmeister, T Aziridine-2,3-dicarboxylate inhibitors targeting the major cysteine protease of Trypanosoma brucei as lead trypanocidal agents. Bioorg Med Chem Lett16:2753-7 (2006) 
 
Cysteine protease
Name:Cysteine protease
Synonyms:Rhodesain
Type:PROTEIN
Mol. Mass.:48425.78
Organism:Trypanosoma brucei rhodesiense
Description:ChEMBL_619861
Residue:450
BDBM50183760
NameBDBM50183760
TypeSmall organic molecule
Emp. Form.C21H27N3O8
Mol. Mass.449.4544
SMILESC[C@@H](NC(=O)[C@@H](Cc1ccccc1)NC(=O)OC(C)(C)C)C(=O)N1[C@@H]([C@H]1C(O)=O)C(O)=O