Reaction Details
TargetCysteine protease
LigandBDBM50183775
Substrate/Competitorn/a
Meas. Tech.ChEMBL_350622 (CHEMBL869006)
Ki 3100±n/a nM
Citation Vicik, RHoerr, VGlaser, MSchultheis, MHansell, EMcKerrow, JHHolzgrabe, UCaffrey, CRPonte-Sucre, AMoll, HStich, ASchirmeister, T Aziridine-2,3-dicarboxylate inhibitors targeting the major cysteine protease of Trypanosoma brucei as lead trypanocidal agents. Bioorg Med Chem Lett16:2753-7 (2006) 
 
Cysteine protease
Name:Cysteine protease
Synonyms:Rhodesain
Type:PROTEIN
Mol. Mass.:48425.78
Organism:Trypanosoma brucei rhodesiense
Description:ChEMBL_619861
Residue:450
BDBM50183775
NameBDBM50183775
TypeSmall organic molecule
Emp. Form.C24H39N3O8
Mol. Mass.497.5818
SMILESCCOC(=O)[C@@H]1[C@H](N1C(=O)[C@@H]1CCCN1C(=O)[C@H](CC(C)C)NC(=O)OC(C)(C)C)C(=O)OCC