Reaction Details
TargetStromelysin-1
LigandBDBM30344
Substrate/Competitorn/a
Meas. Tech.ChEMBL_354052 (CHEMBL870697)
Ki 56±n/a nM
Citation Janser, PNeumann, UMiltz, WFeifel, RBuhl, T A cassette-dosing approach for improvement of oral bioavailability of dual TACE/MMP inhibitors. Bioorg Med Chem Lett16:2632-6 (2006) 
 
Stromelysin-1
Name:Stromelysin-1
Type:Enzyme
Mol. Mass.:53973.13
Organism:Homo sapiens (Human)
Description: P08254
Residue:477
BDBM30344
NameBDBM30344
Synonyms:Cipemastat | Trocade
TypeSmall organic molecule
Emp. Form.C22H36N4O5
Mol. Mass.436.545
SMILESCN1C(=O)N(C[C@@H]([C@@H](CC2CCCC2)C(=O)N2CCCCC2)C(=O)NO)C(=O)C1(C)C