Reaction Details
TargetStromelysin-1
LigandBDBM50183783
Substrate/Competitorn/a
Meas. Tech.ChEMBL_354052 (CHEMBL870697)
Ki 12±n/a nM
Citation Janser, PNeumann, UMiltz, WFeifel, RBuhl, T A cassette-dosing approach for improvement of oral bioavailability of dual TACE/MMP inhibitors. Bioorg Med Chem Lett16:2632-6 (2006) 
 
Stromelysin-1
Name:Stromelysin-1
Type:Enzyme
Mol. Mass.:53973.13
Organism:Homo sapiens (Human)
Description: P08254
Residue:477
BDBM50183783
NameBDBM50183783
Synonyms:(2S,3R)-N1-((S)-3,3-dimethyl-1-(methylamino)-1-oxobutan-2-yl)-N4-hydroxy-2-(4-methoxyphenyl)-3-((3,4,4-trimethyl-2,5-dioxoimidazolidin-1-yl)methyl)succinamide | CHEMBL208181
TypeSmall organic molecule
Emp. Form.C25H37N5O7
Mol. Mass.519.5906
SMILESCNC(=O)[C@@H](NC(=O)[C@@H]([C@H](CN1C(=O)N(C)C(C)(C)C1=O)C(=O)NO)c1ccc(OC)cc1)C(C)(C)C