Reaction Details
TargetDisintegrin and metalloproteinase domain-containing protein 17
LigandBDBM50183782
Substrate/Competitorn/a
Meas. Tech.ChEMBL_354055 (CHEMBL870009)
IC50>10000±n/a nM
Citation Janser, PNeumann, UMiltz, WFeifel, RBuhl, T A cassette-dosing approach for improvement of oral bioavailability of dual TACE/MMP inhibitors. Bioorg Med Chem Lett16:2632-6 (2006) 
 
Disintegrin and metalloproteinase domain-containing protein 17
Name:Disintegrin and metalloproteinase domain-containing protein 17
Type:Enzyme
Mol. Mass.:93007.89
Organism:Homo sapiens (Human)
Description:
Residue:824
BDBM50183782
NameBDBM50183782
Synonyms:(2R,3S)-N-hydroxy-3-(4-methoxyphenyl)-4-oxo-4-(piperidin-1-yl)-2-((3,4,4-trimethyl-2,5-dioxoimidazolidin-1-yl)methyl)butanamide | CHEMBL438964
TypeSmall organic molecule
Emp. Form.C23H32N4O6
Mol. Mass.460.5234
SMILESCOc1ccc(cc1)[C@H]([C@H](CN1C(=O)N(C)C(C)(C)C1=O)C(=O)NO)C(=O)N1CCCCC1