Reaction Details
TargetDisintegrin and metalloproteinase domain-containing protein 17
LigandBDBM50183787
Substrate/Competitorn/a
Meas. Tech.ChEMBL_354055 (CHEMBL870009)
IC50>10000±n/a nM
Citation Janser, PNeumann, UMiltz, WFeifel, RBuhl, T A cassette-dosing approach for improvement of oral bioavailability of dual TACE/MMP inhibitors. Bioorg Med Chem Lett16:2632-6 (2006) 
 
Disintegrin and metalloproteinase domain-containing protein 17
Name:Disintegrin and metalloproteinase domain-containing protein 17
Type:Enzyme
Mol. Mass.:93007.89
Organism:Homo sapiens (Human)
Description:
Residue:824
BDBM50183787
NameBDBM50183787
Synonyms:(S)-1-((2S,3R)-4-(hydroxyamino)-3-(hydroxymethyl)-2-(4-methoxyphenyl)-4-oxobutanoyl)-N-methylpiperidine-2-carboxamide | CHEMBL439330
TypeSmall organic molecule
Emp. Form.C19H27N3O6
Mol. Mass.393.4342
SMILESCNC(=O)[C@@H]1CCCCN1C(=O)[C@@H]([C@H](CO)C(=O)NO)c1ccc(OC)cc1