Reaction Details
TargetcAMP-specific 3',5'-cyclic phosphodiesterase 4D
LigandBDBM50183805
Substrate/Competitorn/a
Meas. Tech.ChEMBL_353751 (CHEMBL866914)
IC50 0.1±n/a nM
Citation Lacombe, PDeschênes, DDubé, DDubé, LGallant, MMacdonald, DMastracchio, APerrier, HCharleson, SHuang, ZLaliberté, FLiu, SMancini, JAMasson, PSalem, MStyhler, AGirard, Y Nitrogen-bridged substituted 8-arylquinolines as potent PDE IV inhibitors. Bioorg Med Chem Lett16:2608-12 (2006) 
 
cAMP-specific 3',5'-cyclic phosphodiesterase 4D
Name:cAMP-specific 3',5'-cyclic phosphodiesterase 4D
Type:Protein
Mol. Mass.:91092.69
Organism:Homo sapiens (Human)
Description:Q08499
Residue:809
BDBM50183805
NameBDBM50183805
Synonyms:1-((3-(6-(2-cyanopropan-2-yl)quinolin-8-yl)phenyl)methyl)-1-(4-(methylsulfonyl)phenyl)-3-phenylurea | CHEMBL380321
TypeSmall organic molecule
Emp. Form.C34H30N4O3S
Mol. Mass.574.692
SMILESCC(C)(C#N)c1cc(-c2cccc(CN(C(=O)Nc3ccccc3)c3ccc(cc3)S(C)(=O)=O)c2)c2ncccc2c1