Reaction Details
TargetcAMP-specific 3',5'-cyclic phosphodiesterase 4C
LigandBDBM50183806
Substrate/Competitorn/a
Meas. Tech.ChEMBL_353750 (CHEMBL866913)
IC50 10.6±n/a nM
Citation Lacombe, PDeschênes, DDubé, DDubé, LGallant, MMacdonald, DMastracchio, APerrier, HCharleson, SHuang, ZLaliberté, FLiu, SMancini, JAMasson, PSalem, MStyhler, AGirard, Y Nitrogen-bridged substituted 8-arylquinolines as potent PDE IV inhibitors. Bioorg Med Chem Lett16:2608-12 (2006) 
 
cAMP-specific 3',5'-cyclic phosphodiesterase 4C
Name:cAMP-specific 3',5'-cyclic phosphodiesterase 4C
Type:Enzyme Catalytic Domain
Mol. Mass.:79875.54
Organism:Homo sapiens (Human)
Description:Q08493
Residue:712
BDBM50183806
NameBDBM50183806
Synonyms:4-(methylsulfonyl)-N-(3-(6-(2-(methylsulfonyl)propan-2-yl)quinolin-8-yl)phenyl)benzamide | CHEMBL208236
TypeSmall organic molecule
Emp. Form.C27H26N2O5S2
Mol. Mass.522.636
SMILESCC(C)(c1cc(-c2cccc(NC(=O)c3ccc(cc3)S(C)(=O)=O)c2)c2ncccc2c1)S(C)(=O)=O