Reaction Details
TargetcAMP-specific 3',5'-cyclic phosphodiesterase 4B
LigandBDBM50183804
Substrate/Competitorn/a
Meas. Tech.ChEMBL_353741 (CHEMBL866235)
IC50 270±n/a nM
Citation Lacombe, PDeschênes, DDubé, DDubé, LGallant, MMacdonald, DMastracchio, APerrier, HCharleson, SHuang, ZLaliberté, FLiu, SMancini, JAMasson, PSalem, MStyhler, AGirard, Y Nitrogen-bridged substituted 8-arylquinolines as potent PDE IV inhibitors. Bioorg Med Chem Lett16:2608-12 (2006) 
 
cAMP-specific 3',5'-cyclic phosphodiesterase 4B
Name:cAMP-specific 3',5'-cyclic phosphodiesterase 4B
Type:Protein
Mol. Mass.:83318.87
Organism:Homo sapiens (Human)
Description:Q07343
Residue:736
BDBM50183804
NameBDBM50183804
Synonyms:4-(2-hydroxypropan-2-yl)-N-(4-(methylsulfonyl)phenyl)-N-(1-(3-(6-(2-(methylsulfonyl)propan-2-yl)quinolin-8-yl)phenyl)ethyl)benzamide | CHEMBL380933
TypeSmall organic molecule
Emp. Form.C38H40N2O6S2
Mol. Mass.684.864
SMILESCC(N(C(=O)c1ccc(cc1)C(C)(C)O)c1ccc(cc1)S(C)(=O)=O)c1cccc(c1)-c1cc(cc2cccnc12)C(C)(C)S(C)(=O)=O