Reaction Details
TargetcAMP-specific 3',5'-cyclic phosphodiesterase 4D
LigandBDBM50183791
Substrate/Competitorn/a
Meas. Tech.ChEMBL_353751 (CHEMBL866914)
IC50 0.3±n/a nM
Citation Lacombe, PDeschênes, DDubé, DDubé, LGallant, MMacdonald, DMastracchio, APerrier, HCharleson, SHuang, ZLaliberté, FLiu, SMancini, JAMasson, PSalem, MStyhler, AGirard, Y Nitrogen-bridged substituted 8-arylquinolines as potent PDE IV inhibitors. Bioorg Med Chem Lett16:2608-12 (2006) 
 
cAMP-specific 3',5'-cyclic phosphodiesterase 4D
Name:cAMP-specific 3',5'-cyclic phosphodiesterase 4D
Type:Protein
Mol. Mass.:91092.69
Organism:Homo sapiens (Human)
Description:Q08499
Residue:809
BDBM50183791
NameBDBM50183791
Synonyms:CHEMBL209295 | isopropyl (3-(6-(2-cyanopropan-2-yl)quinolin-8-yl)phenyl)methyl(4-(methylsulfonyl)phenyl)carbamate
TypeSmall organic molecule
Emp. Form.C31H31N3O4S
Mol. Mass.541.661
SMILESCC(C)OC(=O)N(Cc1cccc(c1)-c1cc(cc2cccnc12)C(C)(C)C#N)c1ccc(cc1)S(C)(=O)=O