Reaction Details
TargetcAMP-specific 3',5'-cyclic phosphodiesterase 4A
LigandBDBM50183791
Substrate/Competitorn/a
Meas. Tech.ChEMBL_353740 (CHEMBL866234)
IC50 0.3±n/a nM
Citation Lacombe, PDeschênes, DDubé, DDubé, LGallant, MMacdonald, DMastracchio, APerrier, HCharleson, SHuang, ZLaliberté, FLiu, SMancini, JAMasson, PSalem, MStyhler, AGirard, Y Nitrogen-bridged substituted 8-arylquinolines as potent PDE IV inhibitors. Bioorg Med Chem Lett16:2608-12 (2006) 
 
cAMP-specific 3',5'-cyclic phosphodiesterase 4A
Name:cAMP-specific 3',5'-cyclic phosphodiesterase 4A
Type:Enzyme
Mol. Mass.:98113.27
Organism:Homo sapiens (Human)
Description:P27815
Residue:886
BDBM50183791
NameBDBM50183791
Synonyms:CHEMBL209295 | isopropyl (3-(6-(2-cyanopropan-2-yl)quinolin-8-yl)phenyl)methyl(4-(methylsulfonyl)phenyl)carbamate
TypeSmall organic molecule
Emp. Form.C31H31N3O4S
Mol. Mass.541.661
SMILESCC(C)OC(=O)N(Cc1cccc(c1)-c1cc(cc2cccnc12)C(C)(C)C#N)c1ccc(cc1)S(C)(=O)=O