Reaction Details
TargetcAMP-specific 3',5'-cyclic phosphodiesterase 4B
LigandBDBM50183788
Substrate/Competitorn/a
Meas. Tech.ChEMBL_353741 (CHEMBL866235)
IC50 200±n/a nM
Citation Lacombe, PDeschênes, DDubé, DDubé, LGallant, MMacdonald, DMastracchio, APerrier, HCharleson, SHuang, ZLaliberté, FLiu, SMancini, JAMasson, PSalem, MStyhler, AGirard, Y Nitrogen-bridged substituted 8-arylquinolines as potent PDE IV inhibitors. Bioorg Med Chem Lett16:2608-12 (2006) 
 
cAMP-specific 3',5'-cyclic phosphodiesterase 4B
Name:cAMP-specific 3',5'-cyclic phosphodiesterase 4B
Type:Protein
Mol. Mass.:83318.87
Organism:Homo sapiens (Human)
Description:Q07343
Residue:736
BDBM50183788
NameBDBM50183788
Synonyms:3-(6-(2-(methylsulfonyl)propan-2-yl)quinolin-8-yl)-N-(pyridin-4-yl)benzamide | CHEMBL383837
TypeSmall organic molecule
Emp. Form.C25H23N3O3S
Mol. Mass.445.533
SMILESCC(C)(c1cc(-c2cccc(c2)C(=O)Nc2ccncc2)c2ncccc2c1)S(C)(=O)=O