Reaction Details
TargetPotassium voltage-gated channel subfamily H member 2
LigandBDBM50183955
Substrate/Competitorn/a
Meas. Tech.ChEMBL_353888 (CHEMBL865039)
Ki>2000±n/a nM
Citation Blackburn, CLaMarche, MJBrown, JChe, JLCullis, CALai, SMaguire, MMarsilje, TGeddes, BGovek, EKadambi, VDoherty, CDayton, BBrodjian, SMarsh, KCCollins, CAKym, PR Identification and characterization of amino-piperidinequinolones and quinazolinones as MCHr1 antagonists. Bioorg Med Chem Lett16:2621-7 (2006) 
 
Potassium voltage-gated channel subfamily H member 2
Name:Potassium voltage-gated channel subfamily H member 2
Type:Multi-pass membrane protein
Mol. Mass.:126672.65
Organism:Homo sapiens (Human)
Description:Q12809
Residue:1159
BDBM50183955
NameBDBM50183955
Synonyms:6-chloro-1-methyl-4-(1-(naphthalen-2-ylmethyl)piperidin-4-ylamino)-2-oxo-1,2-dihydroquinoline-3-carbonitrile | CHEMBL207257
TypeSmall organic molecule
Emp. Form.C27H25ClN4O
Mol. Mass.456.967
SMILESCn1c2ccc(Cl)cc2c(NC2CCN(Cc3ccc4ccccc4c3)CC2)c(C#N)c1=O