Reaction Details
TargetPotassium voltage-gated channel subfamily H member 2
LigandBDBM50183961
Substrate/Competitorn/a
Meas. Tech.ChEMBL_353888 (CHEMBL865039)
Ki 1440±n/a nM
Citation Blackburn, CLaMarche, MJBrown, JChe, JLCullis, CALai, SMaguire, MMarsilje, TGeddes, BGovek, EKadambi, VDoherty, CDayton, BBrodjian, SMarsh, KCCollins, CAKym, PR Identification and characterization of amino-piperidinequinolones and quinazolinones as MCHr1 antagonists. Bioorg Med Chem Lett16:2621-7 (2006) 
 
Potassium voltage-gated channel subfamily H member 2
Name:Potassium voltage-gated channel subfamily H member 2
Type:Multi-pass membrane protein
Mol. Mass.:126672.65
Organism:Homo sapiens (Human)
Description:Q12809
Residue:1159
BDBM50183961
NameBDBM50183961
Synonyms:CHEMBL205741 | methyl 4-(1-(benzo[d][1,3]dioxol-5-ylmethyl)piperidin-4-ylamino)-6-chloro-1-methyl-2-oxo-1,2-dihydroquinoline-3-carboxylate
TypeSmall organic molecule
Emp. Form.C25H26ClN3O5
Mol. Mass.483.944
SMILESCOC(=O)c1c(NC2CCN(Cc3ccc4OCOc4c3)CC2)c2cc(Cl)ccc2n(C)c1=O