Reaction Details
TargetPotassium voltage-gated channel subfamily H member 2
LigandBDBM50183974
Substrate/Competitorn/a
Meas. Tech.ChEMBL_353888 (CHEMBL865039)
Ki 30±n/a nM
Citation Blackburn, CLaMarche, MJBrown, JChe, JLCullis, CALai, SMaguire, MMarsilje, TGeddes, BGovek, EKadambi, VDoherty, CDayton, BBrodjian, SMarsh, KCCollins, CAKym, PR Identification and characterization of amino-piperidinequinolones and quinazolinones as MCHr1 antagonists. Bioorg Med Chem Lett16:2621-7 (2006) 
 
Potassium voltage-gated channel subfamily H member 2
Name:Potassium voltage-gated channel subfamily H member 2
Type:Multi-pass membrane protein
Mol. Mass.:126672.65
Organism:Homo sapiens (Human)
Description:Q12809
Residue:1159
BDBM50183974
NameBDBM50183974
Synonyms:(E)-6-chloro-4-(1-cinnamylpiperidin-4-ylamino)-1-methylquinolin-2(1H)-one | CHEMBL377884
TypeSmall organic molecule
Emp. Form.C24H26ClN3O
Mol. Mass.407.936
SMILESCn1c2ccc(Cl)cc2c(NC2CCN(C\C=C\c3ccccc3)CC2)cc1=O