Reaction Details
TargetPotassium voltage-gated channel subfamily H member 2
LigandBDBM50183958
Substrate/Competitorn/a
Meas. Tech.ChEMBL_353888 (CHEMBL865039)
Ki 310±n/a nM
Citation Blackburn, CLaMarche, MJBrown, JChe, JLCullis, CALai, SMaguire, MMarsilje, TGeddes, BGovek, EKadambi, VDoherty, CDayton, BBrodjian, SMarsh, KCCollins, CAKym, PR Identification and characterization of amino-piperidinequinolones and quinazolinones as MCHr1 antagonists. Bioorg Med Chem Lett16:2621-7 (2006) 
 
Potassium voltage-gated channel subfamily H member 2
Name:Potassium voltage-gated channel subfamily H member 2
Type:Multi-pass membrane protein
Mol. Mass.:126672.65
Organism:Homo sapiens (Human)
Description:Q12809
Residue:1159
BDBM50183958
NameBDBM50183958
Synonyms:4-(8-(benzo[d][1,3]dioxol-5-ylmethyl)-8-aza-bicyclo[3.2.1]octan-3-ylamino)-6-chloro-1-methylquinazolin-2(1H)-one | CHEMBL448110
TypeSmall organic molecule
Emp. Form.C24H25ClN4O3
Mol. Mass.452.933
SMILESCn1c2ccc(Cl)cc2c(NC2CC3CCC(C2)N3Cc2ccc3OCOc3c2)nc1=O