Reaction Details
TargetFocal adhesion kinase 1
LigandBDBM50183980
Substrate/Competitorn/a
Meas. Tech.ChEMBL_355040 (CHEMBL870124)
IC50 119±n/a nM
Citation Choi, HSWang, ZRichmond, WHe, XYang, KJiang, TKaranewsky, DGu, XJZhou, VLiu, YChe, JLee, CCCaldwell, JKanazawa, TUmemura, IMatsuura, NOhmori, OHonda, TGray, NHe, Y Design and synthesis of 7H-pyrrolo[2,3-d]pyrimidines as focal adhesion kinase inhibitors. Part 2. Bioorg Med Chem Lett16:2689-92 (2006) 
 
Focal adhesion kinase 1
Name:Focal adhesion kinase 1
Type:Tyrosine-protein kinase
Mol. Mass.:119233.17
Organism:Homo sapiens (Human)
Description:Q05397
Residue:1052
BDBM50183980
NameBDBM50183980
Synonyms:7-(3-(2-(2H-tetrazol-5-yl)ethyl)phenyl)-N-(3,4,5-trimethoxyphenyl)-7H-pyrrolo[2,3-d]pyrimidin-2-amine | CHEMBL209044
TypeSmall organic molecule
Emp. Form.C24H24N8O3
Mol. Mass.472.4992
SMILESCOc1cc(Nc2ncc3ccn(-c4cccc(CCc5nnn[nH]5)c4)c3n2)cc(OC)c1OC