Reaction Details
TargetFocal adhesion kinase 1
LigandBDBM50183990
Substrate/Competitorn/a
Meas. Tech.ChEMBL_355040 (CHEMBL870124)
IC50>10000±n/a nM
Citation Choi, HSWang, ZRichmond, WHe, XYang, KJiang, TKaranewsky, DGu, XJZhou, VLiu, YChe, JLee, CCCaldwell, JKanazawa, TUmemura, IMatsuura, NOhmori, OHonda, TGray, NHe, Y Design and synthesis of 7H-pyrrolo[2,3-d]pyrimidines as focal adhesion kinase inhibitors. Part 2. Bioorg Med Chem Lett16:2689-92 (2006) 
 
Focal adhesion kinase 1
Name:Focal adhesion kinase 1
Type:Tyrosine-protein kinase
Mol. Mass.:119233.17
Organism:Homo sapiens (Human)
Description:Q05397
Residue:1052
BDBM50183990
NameBDBM50183990
Synonyms:7-(2-ethylphenyl)-N-(3,4,5-trimethoxyphenyl)-7H-pyrrolo[2,3-d]pyrimidin-2-amine | CHEMBL379071
TypeSmall organic molecule
Emp. Form.C23H24N4O3
Mol. Mass.404.4617
SMILESCCc1ccccc1-n1ccc2cnc(Nc3cc(OC)c(OC)c(OC)c3)nc12