Reaction Details
TargetFocal adhesion kinase 1
LigandBDBM50183995
Substrate/Competitorn/a
Meas. Tech.ChEMBL_355040 (CHEMBL870124)
IC50 242±n/a nM
Citation Choi, HSWang, ZRichmond, WHe, XYang, KJiang, TKaranewsky, DGu, XJZhou, VLiu, YChe, JLee, CCCaldwell, JKanazawa, TUmemura, IMatsuura, NOhmori, OHonda, TGray, NHe, Y Design and synthesis of 7H-pyrrolo[2,3-d]pyrimidines as focal adhesion kinase inhibitors. Part 2. Bioorg Med Chem Lett16:2689-92 (2006) 
 
Focal adhesion kinase 1
Name:Focal adhesion kinase 1
Type:Tyrosine-protein kinase
Mol. Mass.:119233.17
Organism:Homo sapiens (Human)
Description:Q05397
Residue:1052
BDBM50183995
NameBDBM50183995
Synonyms:CHEMBL380312 | N-(2-cyanoethyl)-6-(2-(3,4,5-trimethoxyphenylamino)-7H-pyrrolo[2,3-d]pyrimidin-7-yl)picolinamide
TypeSmall organic molecule
Emp. Form.C24H23N7O4
Mol. Mass.473.4839
SMILESCOc1cc(Nc2ncc3ccn(-c4cccc(n4)C(=O)NCCC#N)c3n2)cc(OC)c1OC