Reaction Details
TargetFocal adhesion kinase 1
LigandBDBM50184002
Substrate/Competitorn/a
Meas. Tech.ChEMBL_355040 (CHEMBL870124)
IC50 54±n/a nM
Citation Choi, HSWang, ZRichmond, WHe, XYang, KJiang, TKaranewsky, DGu, XJZhou, VLiu, YChe, JLee, CCCaldwell, JKanazawa, TUmemura, IMatsuura, NOhmori, OHonda, TGray, NHe, Y Design and synthesis of 7H-pyrrolo[2,3-d]pyrimidines as focal adhesion kinase inhibitors. Part 2. Bioorg Med Chem Lett16:2689-92 (2006) 
 
Focal adhesion kinase 1
Name:Focal adhesion kinase 1
Type:Tyrosine-protein kinase
Mol. Mass.:119233.17
Organism:Homo sapiens (Human)
Description:Q05397
Residue:1052
BDBM50184002
NameBDBM50184002
Synonyms:CHEMBL207961 | N-(3-(dimethylamino)propyl)-3-(2-(3,4,5-trimethoxyphenylamino)-7H-pyrrolo[2,3-d]pyrimidin-7-yl)benzamide
TypeSmall organic molecule
Emp. Form.C27H32N6O4
Mol. Mass.504.5808
SMILESCOc1cc(Nc2ncc3ccn(-c4cccc(c4)C(=O)NCCCN(C)C)c3n2)cc(OC)c1OC