Reaction Details
TargetFocal adhesion kinase 1
LigandBDBM50184009
Substrate/Competitorn/a
Meas. Tech.ChEMBL_355040 (CHEMBL870124)
IC50 7550±n/a nM
Citation Choi, HSWang, ZRichmond, WHe, XYang, KJiang, TKaranewsky, DGu, XJZhou, VLiu, YChe, JLee, CCCaldwell, JKanazawa, TUmemura, IMatsuura, NOhmori, OHonda, TGray, NHe, Y Design and synthesis of 7H-pyrrolo[2,3-d]pyrimidines as focal adhesion kinase inhibitors. Part 2. Bioorg Med Chem Lett16:2689-92 (2006) 
 
Focal adhesion kinase 1
Name:Focal adhesion kinase 1
Type:Tyrosine-protein kinase
Mol. Mass.:119233.17
Organism:Homo sapiens (Human)
Description:Q05397
Residue:1052
BDBM50184009
NameBDBM50184009
Synonyms:CHEMBL205584 | N-methyl-6-(2-(3,4,5-trimethoxyphenylamino)-7H-pyrrolo[2,3-d]pyrimidin-7-yl)picolinamide
TypeSmall organic molecule
Emp. Form.C22H22N6O4
Mol. Mass.434.4479
SMILESCNC(=O)c1cccc(n1)-n1ccc2cnc(Nc3cc(OC)c(OC)c(OC)c3)nc12