Reaction Details
TargetFocal adhesion kinase 1
LigandBDBM50184018
Substrate/Competitorn/a
Meas. Tech.ChEMBL_355040 (CHEMBL870124)
IC50 236±n/a nM
Citation Choi, HSWang, ZRichmond, WHe, XYang, KJiang, TKaranewsky, DGu, XJZhou, VLiu, YChe, JLee, CCCaldwell, JKanazawa, TUmemura, IMatsuura, NOhmori, OHonda, TGray, NHe, Y Design and synthesis of 7H-pyrrolo[2,3-d]pyrimidines as focal adhesion kinase inhibitors. Part 2. Bioorg Med Chem Lett16:2689-92 (2006) 
 
Focal adhesion kinase 1
Name:Focal adhesion kinase 1
Type:Tyrosine-protein kinase
Mol. Mass.:119233.17
Organism:Homo sapiens (Human)
Description:Q05397
Residue:1052
BDBM50184018
NameBDBM50184018
Synonyms:CHEMBL204686 | N-(2-(dimethylamino)ethyl)-3-(3-(2-(3,4,5-trimethoxyphenylamino)-7H-pyrrolo[2,3-d]pyrimidin-7-yl)phenyl)propanamide
TypeSmall organic molecule
Emp. Form.C28H34N6O4
Mol. Mass.518.6074
SMILESCOc1cc(Nc2ncc3ccn(-c4cccc(CCC(=O)NCCN(C)C)c4)c3n2)cc(OC)c1OC