Reaction Details
TargetFocal adhesion kinase 1
LigandBDBM50184041
Substrate/Competitorn/a
Meas. Tech.ChEMBL_355040 (CHEMBL870124)
IC50 235±n/a nM
Citation Choi, HSWang, ZRichmond, WHe, XYang, KJiang, TKaranewsky, DGu, XJZhou, VLiu, YChe, JLee, CCCaldwell, JKanazawa, TUmemura, IMatsuura, NOhmori, OHonda, TGray, NHe, Y Design and synthesis of 7H-pyrrolo[2,3-d]pyrimidines as focal adhesion kinase inhibitors. Part 2. Bioorg Med Chem Lett16:2689-92 (2006) 
 
Focal adhesion kinase 1
Name:Focal adhesion kinase 1
Type:Tyrosine-protein kinase
Mol. Mass.:119233.17
Organism:Homo sapiens (Human)
Description:Q05397
Residue:1052
BDBM50184041
NameBDBM50184041
Synonyms:7-(3-(trifluoromethyl)phenyl)-N-(3,4,5-trimethoxyphenyl)-7H-pyrrolo[2,3-d]pyrimidin-2-amine | CHEMBL207737
TypeSmall organic molecule
Emp. Form.C22H19F3N4O3
Mol. Mass.444.4065
SMILESCOc1cc(Nc2ncc3ccn(-c4cccc(c4)C(F)(F)F)c3n2)cc(OC)c1OC