Reaction Details
TargetCalcitonin gene-related peptide type 1 receptor/Receptor activity-modifying protein 1
LigandBDBM50184073
Substrate/Competitorn/a
Meas. Tech.ChEMBL_353838 (CHEMBL866916)
Ki>13000±n/a nM
Citation Williams, TMStump, CANguyen, DNQuigley, AGBell, IMGallicchio, SNZartman, CBWan, BLPenna, KDKunapuli, PKane, SAKoblan, KSMosser, SDRutledge, RZSalvatore, CFay, JFVacca, JPGraham, SL Non-peptide calcitonin gene-related peptide receptor antagonists from a benzodiazepinone lead. Bioorg Med Chem Lett16:2595-8 (2006) 
 
Calcitonin gene-related peptide type 1 receptor/Receptor activity-modifying protein 1
Name:Calcitonin gene-related peptide type 1 receptor/Receptor activity-modifying protein 1
Synonyms:Calcitonin-gene-related peptide receptor, CALCRL/RAMP1
Type:n/a
Mol. Mass.:n/a
Description:ASSAY_ID of EBI is 327200
Components:This complex has 2 components.
Component 1
Name:Calcitonin gene-related peptide type 1 receptor
Type:Enzyme Catalytic Domain
Mol. Mass.:52980.45
Organism:Homo sapiens (Human)
Description:Q16602
Residue:461
Component 2
Name:Receptor activity-modifying protein 1
Synonyms:Calcitonin-gene-related peptide receptor, CALCRL/RAMP1 RAMP1_HUMAN
Type:PROTEIN
Mol. Mass.:16992.80
Organism:Homo sapiens (Human)
Description:EBI_100673
Residue:148
BDBM50184073
NameBDBM50184073
Synonyms:(R,S)-N-(1-methyl-2-oxo-5-phenyl-2,3-dihydro-1H-benzo[e][1,4]diazepin-3-yl)-4-(2-oxo-2,3-dihydrobenzo[d]imidazol-1-yl)piperidine-1-carboxamide | CHEMBL206149
TypeSmall organic molecule
Emp. Form.C29H28N6O3
Mol. Mass.508.571
SMILESCN1c2ccccc2C(=NC(NC(=O)N2CCC(CC2)n2c3ccccc3[nH]c2=O)C1=O)c1ccccc1