Reaction Details
TargetMicrosomal triglyceride transfer protein large subunit
LigandBDBM50184118
Substrate/Competitorn/a
Meas. Tech.ChEMBL_364710 (CHEMBL866306)
IC50 2±n/a nM
Citation Li, JBertinato, PCheng, HCole, BMBronk, BSJaynes, BHHickman, AHaven, MLKolosko, NLBarry, CJManion, TB Discovery of potent and orally active MTP inhibitors as potential anti-obesity agents. Bioorg Med Chem Lett16:3039-42 (2006) 
 
Microsomal triglyceride transfer protein large subunit
Name:Microsomal triglyceride transfer protein large subunit
Type:PROTEIN
Mol. Mass.:99365.65
Organism:Homo sapiens (Human)
Description:ChEMBL_971724
Residue:894
BDBM50184118
NameBDBM50184118
Synonyms:4'-trifluoromethyl-biphenyl-2-carboxylic acid {2-methoxy-4-[((S)-phenyl-propylcarbamoyl-methyl)-carbamoyl]-phenyl}-amide | CHEMBL377951
TypeSmall organic molecule
Emp. Form.C33H30F3N3O4
Mol. Mass.589.6042
SMILESCCCNC(=O)[C@@H](NC(=O)c1ccc(NC(=O)c2ccccc2-c2ccc(cc2)C(F)(F)F)c(OC)c1)c1ccccc1