Reaction Details
TargetB1 bradykinin receptor
LigandBDBM50184174
Substrate/Competitorn/a
Meas. Tech.ChEMBL_350972 (CHEMBL858907)
Ki 1.7±n/a nM
Citation Kuduk, SDDi Marco, CNChang, RKWood, MRKim, JJSchirripa, KMMurphy, KLRansom, RWTang, CTorrent, MHa, SPrueksaritanont, TPettibone, DJBock, MG 5-Piperazinyl pyridine carboxamide bradykinin B1 antagonists. Bioorg Med Chem Lett16:2791-5 (2006) 
 
B1 bradykinin receptor
Name:B1 bradykinin receptor
Type:Enzyme
Mol. Mass.:40508.87
Organism:Homo sapiens (Human)
Description:P46663
Residue:353
BDBM50184174
NameBDBM50184174
Synonyms:4'-{[5-(4-cyclopentylmethyl-piperazine-1-carbonyl)-pyridin-2-ylamino]-methyl}-3,3'-difluoro-biphenyl-2-carboxylic acid methyl ester | CHEMBL380679
TypeSmall organic molecule
Emp. Form.C31H34F2N4O3
Mol. Mass.548.6235
SMILESCOC(=O)c1c(F)cccc1-c1ccc(CNc2ccc(cn2)C(=O)N2CCN(CC3CCCC3)CC2)c(F)c1