Reaction Details
TargetB1 bradykinin receptor
LigandBDBM50184181
Substrate/Competitorn/a
Meas. Tech.ChEMBL_350972 (CHEMBL858907)
Ki 5.5±n/a nM
Citation Kuduk, SDDi Marco, CNChang, RKWood, MRKim, JJSchirripa, KMMurphy, KLRansom, RWTang, CTorrent, MHa, SPrueksaritanont, TPettibone, DJBock, MG 5-Piperazinyl pyridine carboxamide bradykinin B1 antagonists. Bioorg Med Chem Lett16:2791-5 (2006) 
 
B1 bradykinin receptor
Name:B1 bradykinin receptor
Type:Enzyme
Mol. Mass.:40508.87
Organism:Homo sapiens (Human)
Description:P46663
Residue:353
BDBM50184181
NameBDBM50184181
Synonyms:3,3'-difluoro-4'-{[5-(piperazine-1-carbonyl)-pyridin-2-ylamino]-methyl}-biphenyl-2-carboxylic acid methyl ester | CHEMBL207122
TypeSmall organic molecule
Emp. Form.C25H24F2N4O3
Mol. Mass.466.4799
SMILESCOC(=O)c1c(F)cccc1-c1ccc(CNc2ccc(cn2)C(=O)N2CCNCC2)c(F)c1