Reaction Details
TargetB1 bradykinin receptor
LigandBDBM50184185
Substrate/Competitorn/a
Meas. Tech.ChEMBL_350972 (CHEMBL858907)
Ki 611±n/a nM
Citation Kuduk, SDDi Marco, CNChang, RKWood, MRKim, JJSchirripa, KMMurphy, KLRansom, RWTang, CTorrent, MHa, SPrueksaritanont, TPettibone, DJBock, MG 5-Piperazinyl pyridine carboxamide bradykinin B1 antagonists. Bioorg Med Chem Lett16:2791-5 (2006) 
 
B1 bradykinin receptor
Name:B1 bradykinin receptor
Type:Enzyme
Mol. Mass.:40508.87
Organism:Homo sapiens (Human)
Description:P46663
Residue:353
BDBM50184185
NameBDBM50184185
Synonyms:3-chloro-3'-fluoro-4'-[(4-piperidin-1-ylmethyl-pyridin-2-ylamino)-methyl]-biphenyl-2-carboxylic acid methyl ester | CHEMBL377440
TypeSmall organic molecule
Emp. Form.C26H27ClFN3O2
Mol. Mass.467.963
SMILESCOC(=O)c1c(Cl)cccc1-c1ccc(CNc2cc(CN3CCCCC3)ccn2)c(F)c1