Reaction Details
TargetB1 bradykinin receptor
LigandBDBM50184189
Substrate/Competitorn/a
Meas. Tech.ChEMBL_350972 (CHEMBL858907)
Ki 9.1±n/a nM
Citation Kuduk, SDDi Marco, CNChang, RKWood, MRKim, JJSchirripa, KMMurphy, KLRansom, RWTang, CTorrent, MHa, SPrueksaritanont, TPettibone, DJBock, MG 5-Piperazinyl pyridine carboxamide bradykinin B1 antagonists. Bioorg Med Chem Lett16:2791-5 (2006) 
 
B1 bradykinin receptor
Name:B1 bradykinin receptor
Type:Enzyme
Mol. Mass.:40508.87
Organism:Homo sapiens (Human)
Description:P46663
Residue:353
BDBM50184189
NameBDBM50184189
Synonyms:3,3'-difluoro-4'-[(5-piperidin-1-ylmethyl-pyridin-2-ylamino)-methyl]-biphenyl-2-carboxylic acid methyl ester | CHEMBL208248
TypeSmall organic molecule
Emp. Form.C26H27F2N3O2
Mol. Mass.451.5083
SMILESCOC(=O)c1c(F)cccc1-c1ccc(CNc2ccc(CN3CCCCC3)cn2)c(F)c1