Reaction Details
TargetB1 bradykinin receptor
LigandBDBM50184191
Substrate/Competitorn/a
Meas. Tech.ChEMBL_350972 (CHEMBL858907)
Ki 184±n/a nM
Citation Kuduk, SDDi Marco, CNChang, RKWood, MRKim, JJSchirripa, KMMurphy, KLRansom, RWTang, CTorrent, MHa, SPrueksaritanont, TPettibone, DJBock, MG 5-Piperazinyl pyridine carboxamide bradykinin B1 antagonists. Bioorg Med Chem Lett16:2791-5 (2006) 
 
B1 bradykinin receptor
Name:B1 bradykinin receptor
Type:Enzyme
Mol. Mass.:40508.87
Organism:Homo sapiens (Human)
Description:P46663
Residue:353
BDBM50184191
NameBDBM50184191
Synonyms:3,3'-difluoro-4'-[(5-morpholin-4-ylmethyl-pyridin-2-ylamino)-methyl]-biphenyl-2-carboxylic acid methyl ester | CHEMBL207922
TypeSmall organic molecule
Emp. Form.C25H25F2N3O3
Mol. Mass.453.4811
SMILESCOC(=O)c1c(F)cccc1-c1ccc(CNc2ccc(CN3CCOCC3)cn2)c(F)c1